{"text_format":"1","workbook":"xlsx","n_sheets":14,"sheets":["Инструкция","Раздел1","Раздел2","Квартал","Год","Основания","ОКОПФ","КодДоговора","ВидПотребЗайма","СтатусПотребЗайма","ИнтервалПСК","ИнтервалПДН","ИнтервалДохода","ДлительностьПросрочки"],"not_rendered":{"charts":0,"images":4,"macros":1,"external_links":0,"defined_names":0,"comments":0,"pivot_tables":0},"unopened":[],"bounds":{"document_bytes":16777216,"sheet_cells":100000,"rows_first":2000,"rows_last":500,"rows_between":2000,"halvings":0,"cell_chars":16384,"cell_head_chars":4096},"cells_cut":0,"cells_raw":0,"read":"whole","date_system":"1900"}

{"sheet":"Инструкция","index":0,"n_rows":102,"n_cols":1,"rows_kept":102,"cut":false,"hidden":false,"merged":[]}
["Данный файл является демострационным примером реализации программного обеспечения для формирования файла отчета по форме 0420833 \"Отчет о долговой нагрузке заемщиков - физических лиц\" без использования программы-анкеты"]
[]
["ИНСТРУКЦИЯ"]
["1. Последовательность действий"]
["1.1. Заполните ячейки выделенные желтым на листе \"Рездел1\";"]
[]
["1.2. Вставьте данные раздела 2 на лист \"Раздел2\" начиная с третьей строки;"]
[]
["1.3. На листе \"Раздел1\" нажмите кнопку \"Сохранить отчет в XTDD-файл\";"]
["(в зависимости от производительности компьютера и количества строк в разделе 1, ожидание появления диалога выбора имени файла для сохранения отчета может составить от нескольких секунд до десятков минут);"]
[]
["1.4. В появившемся диалоге \"Сохранить файл отчета\" выбирите путь и задайте имя файла для сохранения данных отчета, нажмите кнопку \"Сохранить\";"]
[]
["1.5. Дождитесь сообщения \"Отчет сохранен в файл …\", нажмите \"ОК\";"]
[]
["1.6. Если цвет ярлыка \"Раздел1\" или \"Раздел2\" изменился на красный, данные на соответсвующем листе содержат ошибки (значение одного или нескольких показателей не соответсвуют справочникам, ячейки с ошибочными значениями также будут выделены красным), исправьте ошибки, продолжите с пункта 2.3. настоящей инструкции;"]
[]
["1.7. При необходимости, сохраненный файл отчета может быть открыт и дополнительно проверен в программе-анкете."]
[]
["2. Особенности подготовки данных"]
["2.1. Показатели \"Отчетный квартал\", \"Отчетный год\", \"Основание направления\", \"Код ОКОПФ\" в разделе 1, а также показатели 2-8 раздела 2 должны быть заданы в виде кодов, приведенных в колонке 1 на листах соответствующих справочников;"]
[]
["2.2. Справочники, используемые при подготовке данных отчета, представлены на листах с темно-серым цветом ярлычка;"]
[]
["2.3. В колонке 1 каждого справочника задан код, который должен быть использован в качестве значения в соответсвующем показателе в разделе 1 и 2. Данные коды могут быть переопределены в соответствии со справочниками, используемыми в организации;"]
[]
["3. Использование макросов"]
["3.1. Данная форма содержит макросы (исполняемый код на языке VBA - Visual Basic for Application) для выполнения основного функционала по выгрузке данных отчетности в файл. На многих системах в целях безопасности использование макросов отключено, в связи с этим функционал по выгрузке не будет работать пока не рарзешить использование макросов в данной форме, нажав соответствующую кнопку при открытии файла. (Если меню из криншота ниже не появилось - перейти сперва к пункту 3.2.)"]
[]
[]
[]
[]
[]
[]
[]
[]
[]
[]
[]
[]
[]
[]
["3.2. В случае если система не отображает предупреждение из пункта 3.1. с возможностью включения макросов, необходимо привести настройки макросов в соответствие скриншотам ниже: войти в меню Файл -> Параметры (далее по скриншотам). Затем закрыть книгу и открыть заново - система должна выдать предупреждние п. 3.1."]
[]
[]
[]
[]
[]
[]
[]
[]
[]
[]
[]
[]
[]
[]
[]
[]
[]
[]
[]
[]
[]
[]
[]
[]
[]
[]
[]
[]
[]
[]
[]
[]
[]
[]
[]
[]
[]
[]
[]
[]
[]
[]
[]
[]
[]
[]
[]
[]
[]
[]
[]
[]
[]
[]
[]
[]
[]
["4. Защита ячеек и листов"]
["4.1. Во избежание случайной порчи этой формы ячейки, в которые не предусмотрен ввод данных, были заблокированы. Для опытных пользователей пароль от защиты ячеек \"123\""]

{"sheet":"Раздел1","index":1,"n_rows":20,"n_cols":3,"rows_kept":20,"cut":false,"hidden":false,"merged":[[0,0,0,2],[12,0,12,2]]}
["Сопроводительное письмо"]
["Показатель","Значение (код по справочнику)","Описание"]
["Отчетный квартал:",4,{"$f":"VLOOKUP(B3,Квартал!A:C,3,0)","v":"31 декабря (четвертый квартал)"}]
["Отчетный год:",2022,{"$f":"VLOOKUP(B4,Год!A:C,3,0)","v":"2022"}]
["Отчетная дата:","2022-12-31"]
["Краткое наименование организации:","ООО \"Ромашка\""]
["Руководитель (инициалы, фамилия):","И.И. Иванов"]
["Основание направления:",1,{"$f":"VLOOKUP(B8,Основания!A:C,3,0)","v":"Первичное направление отчетности"}]
["Исходящий номер:","12345"]
["Исходящая дата:","2023-02-05"]
["Примечание:"]
[]
["Раздел 1"]
["Показатель","Значение (код по справочнику)","Описание"]
["Полное наименование организации:","Общество с ограниченной ответственностью \"Ромашка\""]
["Код ОКОПФ:","1 10 00",{"$f":"VLOOKUP(B16,ОКОПФ!A:C,3,0)","v":"1 10 00 (Хозяйственные товарищества)"}]
["ИНН:","1234567894"]
["ОГРН:","1234567890127"]
["Регистрационный номер в реестре МФО:","1111122222333"]
["Адрес МФО:","улица Строителей, д.2"]

{"sheet":"Раздел2","index":2,"n_rows":4,"n_cols":12,"rows_kept":4,"cut":false,"hidden":false,"merged":[]}
["Период, в котором возникли требования по договорам потребительского займа","Код договора","Код вида потребительского займа","Статус займа","Интервал значения полной стоимости потребительского займа (ПСК), в процентах","Интервал значения показателя долговой нагрузки (ПДН) заемщика, в процентах","Интервал дохода заемщика, тысяч рублей","Значение длительности просроченных платежей","Сумма выданных денежных средств, тысяч рублей","Количество договоров займа (траншей), штук","Сумма задолженности по договорам потребительского займа по основному долгу, тысяч рублей","Сумма задолженности по начисленным процентным доходам, включая любые установленные договором потребительского займа доходы, а также неустойку (штрафы, пени), тысяч рублей"]
["1","2","3","4","5","6","7","8","9","10","11","12"]
["12.2022",0,"1.1",1,"[0; 10]","[0; 30]","[0; 12]",0,10,5,20,8]
["12.2022",1,"2.1.1",2,"(10; 20]","(30; 40]","(12; 20]",1,100,50,200,80]

{"sheet":"Квартал","index":3,"n_rows":5,"n_cols":3,"rows_kept":5,"cut":false,"hidden":false,"merged":[]}
["Код по справочнику организации","Код для файла отчета","Описание"]
[1,1,"31 марта (первый квартал)"]
[2,2,"30 июня (второй квартал)"]
[3,3,"30 сентября (третий квартал)"]
[4,4,"31 декабря (четвертый квартал)"]

{"sheet":"Год","index":4,"n_rows":3,"n_cols":3,"rows_kept":3,"cut":false,"hidden":false,"merged":[]}
["Код по справочнику организации","Код для файла отчета","Описание"]
[2022,2022,"2022"]
[2023,2023,"2023"]

{"sheet":"Основания","index":5,"n_rows":5,"n_cols":3,"rows_kept":5,"cut":false,"hidden":false,"merged":[]}
["Код по справочнику организации","Код для файла отчета","Описание"]
[1,1,"Первичное направление отчетности"]
[2,2,"Повторное направление исправленной отчетности"]
[3,3,"Направление отчетности в связи с полученным Предписанием Банка России"]
[4,4,"Первичное направление отчетности в связи с  изменением сведений"]

{"sheet":"ОКОПФ","index":6,"n_rows":33,"n_cols":3,"rows_kept":33,"cut":false,"hidden":false,"merged":[]}
["Код по справочнику организации","Код для файла отчета","Описание"]
["1 10 00",1,"1 10 00 (Хозяйственные товарищества)"]
["1 10 51",2,"1 10 51 (Полные товарищества)"]
["1 10 64",3,"1 10 64 (Товарищества на вере (коммандитные товарищества))"]
["1 20 00",4,"1 20 00 (Хозяйственные общества)"]
["1 22 00",5,"1 22 00 (Акционерные общества)"]
["1 22 47",6,"1 22 47 (Публичные акционерные общества)"]
["1 22 67",7,"1 22 67 (Непубличные акционерные общества)"]
["1 23 00",8,"1 23 00 (Общества с ограниченной ответственностью)"]
["1 30 00",9,"1 30 00 (Хозяйственные партнерства)"]
["1 40 00",10,"1 40 00 (Производственные кооперативы (артели))"]
["1 41 00",11,"1 41 00 (Сельскохозяйственные производственные кооперативы)"]
["1 41 53",26,"1 41 53 (Сельскохозяйственные артели (колхозы))"]
["1 41 54",12,"1 41 54 (Рыболовецкие артели (колхозы))"]
["1 41 55",13,"1 41 55 (Кооперативные хозяйства (коопхозы))"]
["1 42 00",14,"1 42 00 (Производственные кооперативы (кроме сельскохозяйственных производственных кооперативов))"]
["1 53 00",15,"1 53 00 (Крестьянские (фермерские) хозяйства)"]
["1 90 00",16,"1 90 00 (Прочие юридические лица, являющиеся коммерческими организациями)"]
["2 06 00",29,"2 06 00 (Ассоциации (союзы))"]
["2 06 14",30,"2 06 14 (Некоммерческие партнерства)"]
["6 50 00",17,"6 50 00 (Унитарные предприятия)"]
["6 51 00",18,"6 51 00 (Унитарные предприятия, основанные на праве оперативного управления (казенные предприятия))"]
["6 51 41",19,"6 51 41 (Федеральные казенные предприятия)"]
["6 51 42",20,"6 51 42 (Казенные предприятия субъектов Российской Федерации)"]
["6 51 43",21,"6 51 43 (Муниципальные казенные предприятия)"]
["6 52 00",22,"6 52 00 (Унитарные предприятия, основанные на праве хозяйственного ведения)"]
["6 52 41",23,"6 52 41 (Федеральные государственные унитарные предприятия)"]
["6 52 42",24,"6 52 42 (Государственные унитарные предприятия субъектов Российской Федерации)"]
["6 52 43",25,"6 52 43 (Муниципальные унитарные предприятия)"]
["7 04 00",27,"7 04 00 (Фонды)"]
["7 14 00",28,"7 14 00 (Автономные некоммерческие организации)"]
["7 52 01",31,"7 52 01 (Государственные автономные учреждения субъектов Российской Федерации)"]
["7 54 01",32,"7 54 01 (Муниципальные автономные учреждения)"]

{"sheet":"КодДоговора","index":7,"n_rows":3,"n_cols":3,"rows_kept":3,"cut":false,"hidden":false,"merged":[]}
["Код по справочнику организации","Код для файла отчета","Описание"]
[0,1,"0 – для договоров потребительского займа с лимитом кредитования"]
[1,2,"1 – для иных договоров потребительского займа"]

{"sheet":"ВидПотребЗайма","index":8,"n_rows":35,"n_cols":3,"rows_kept":35,"cut":false,"hidden":false,"merged":[]}
["Код по справочнику организации","Код для файла отчета","Описание"]
["1.1",1,"1.1 – для потребительских займов с обеспечением в виде залога (кроме потребительских займов, в том числе таких, обязательства по которым обеспечены залогом (за исключением договоров потребительского займа, обязательства по которым обеспечены залогом транспортного средства, ипотекой), предоставленных путем перечисления денежных средств торгово-сервисному предприятию в счет оплаты его товаров (услуг) или физическому лицу с целью последующего перечисления денежных средств торгово-сервисному предприятию в счет оплаты его товаров (услуг), если обязанность по перечислению денежных средств предусмотрена договором потребительского займа (далее – POS-займы), и потребительских займов, обязательства по которым обеспечены ипотекой) в сумме до 10 тысяч рублей"]
["1.2",2,"1.2 – для потребительских займов с обеспечением в виде залога (кроме POS-займов и потребительских займов, обязательства по которым обеспечены ипотекой) в сумме от 10 тысяч рублей включительно"]
["2.1.1",3,"2.1.1 – для потребительских займов с иным обеспечением (кроме POS-займов и потребительских займов, обязательства по которым обеспечены ипотекой) в сумме до 10 тысяч рублей на срок до 365 дней включительно"]
["2.1.2",4,"2.1.2 – для потребительских займов с иным обеспечением (кроме POS-займов и потребительских займов, обязательства по которым обеспечены ипотекой) в сумме от 10 тысяч рублей включительно на срок до 365 дней включительно"]
["2.2.1",5,"2.2.1 – для потребительских займов с иным обеспечением (кроме POS-займов и потребительских займов, обязательства по которым обеспечены ипотекой) в сумме до 10 тысяч рублей на срок свыше 365 дней"]
["2.2.2",6,"2.2.2 – для потребительских займов с иным обеспечением (кроме POS-займов и потребительских займов, обязательства по которым обеспечены ипотекой) в сумме от 10 тысяч рублей включительно на срок свыше 365 дней"]
["3.1.1",7,"3.1.1 – для потребительских займов без обеспечения (кроме POS-займов) в сумме до 10 тысяч рублей на срок не более 30 дней"]
["3.1.2",8,"3.1.2 – для потребительских займов без обеспечения (кроме POS-займов) в сумме от 10 тысяч рублей включительно до 30 тысяч рублей включительно на срок не более 30 дней"]
["3.1.3",9,"3.1.3 – для потребительских займов без обеспечения (кроме POS-займов) в сумме свыше 30 тысяч рублей на срок не более 30 дней"]
["3.2.1",10,"3.2.1 – для потребительских займов без обеспечения (кроме POS-займов) в сумме до 10 тысяч рублей на срок от 31 до 60 дней включительно"]
["3.2.2",11,"3.2.2 – для потребительских займов без обеспечения (кроме POS-займов) в сумме от 10 тысяч рублей включительно до 30 тысяч рублей включительно на срок от 31 до 60 дней включительно"]
["3.2.3",12,"3.2.3 – для потребительских займов без обеспечения (кроме POS-займов) в сумме свыше 30 тысяч рублей на срок от 31 до 60 дней включительно"]
["3.3.1",13,"3.3.1 – для потребительских займов без обеспечения (кроме POS-займов) в сумме до 10 тысяч рублей на срок от 61 до 180 дней включительно"]
["3.3.2",14,"3.3.2 – для потребительских займов без обеспечения (кроме POS-займов) в сумме от 10 тысяч рублей включительно до 30 тысяч рублей включительно на срок от 61 до 180 дней включительно"]
["3.3.3",15,"3.3.3 – для потребительских займов без обеспечения (кроме POS-займов) в сумме от 30 тысяч рублей до 100 тысяч рублей включительно на срок от 61 до 180 дней включительно"]
["3.3.4",16,"3.3.4 – для потребительских займов без обеспечения (кроме POS-займов) в сумме свыше 100 тысяч рублей на срок от 61 до 180 дней включительно"]
["3.4.1",17,"3.4.1 – для потребительских займов без обеспечения (кроме POS-займов) в сумме до 10 тысяч рублей на срок от 181 до 365 дней включительно"]
["3.4.2",18,"3.4.2 – для потребительских займов без обеспечения (кроме POS-займов) в сумме от 10 тысяч рублей включительно до 100 тысяч рублей включительно на срок от 181 до 365 дней включительно"]
["3.4.3",19,"3.4.3 – для потребительских займов без обеспечения (кроме POS-займов) в сумме свыше 100 тысяч рублей на срок от 181 до 365 дней включительно"]
["3.5.1",20,"3.5.1 – для потребительских займов без обеспечения (кроме POS-займов) в сумме до 10 тысяч рублей на срок свыше 365 дней"]
["3.5.2",21,"3.5.2 – для потребительских займов без обеспечения (кроме POS-займов) в сумме от 10 тысяч рублей включительно до 100 тысяч рублей включительно на срок свыше 365 дней"]
["3.5.3",22,"3.5.3 – для потребительских займов без обеспечения (кроме POS-займов) в сумме свыше 100 тысяч рублей на срок свыше 365 дней"]
["4.1.1",23,"4.1.1 – для POS-займов в сумме до 10 тысяч рублей на срок до 180 дней включительно"]
["4.1.2",24,"4.1.2 – для POS-займов в сумме от 10 тысяч рублей включительно до 30 тысяч рублей включительно на срок до 180 дней включительно"]
["4.1.3",25,"4.1.3 – для POS-займов в сумме свыше 30 тысяч рублей на срок до 180 дней включительно"]
["4.2.1",26,"4.2.1 – для POS-займов в сумме до 10 тысяч рублей на срок от 181 до 305 дней включительно"]
["4.2.2",27,"4.2.2 – для POS-займов в сумме от 10 тысяч рублей включительно до 30 тысяч рублей включительно на срок от 181 до 305 дней включительно"]
["4.2.3",28,"4.2.3 – для POS-займов в сумме свыше 30 тысяч рублей на срок от 181 до 305 дней включительно"]
["4.3.1",29,"4.3.1 – для POS-займов в сумме до 10 тысяч рублей на срок от 306 до 365 дней включительно"]
["4.3.2",30,"4.3.2 – для POS-займов в сумме от 10 тысяч рублей включительно до 30 тысяч рублей включительно на срок от 306 до 365 дней включительно"]
["4.3.3",31,"4.3.3 – для POS-займов в сумме свыше 30 тысяч рублей на срок от 306 до 365 дней включительно"]
["4.4.1",32,"4.4.1 – для POS-займов в сумме до 10 тысяч рублей на срок свыше 365 дней"]
["4.4.2",33,"4.4.2 – для POS-займов в сумме от 10 тысяч рублей включительно на срок свыше 365 дней"]
["5",34,"5 – для потребительских займов, обязательства по которым обеспечены ипотекой"]

{"sheet":"СтатусПотребЗайма","index":9,"n_rows":7,"n_cols":3,"rows_kept":7,"cut":false,"hidden":false,"merged":[]}
["Код по справочнику организации","Код для файла отчета","Описание"]
[1,1,"1 – для потребительских займов, учитываемых на балансовых счетах микрофинансовой организации и не соответствующих кодам «2» и «3»"]
[2,2,"2 – для потребительских займов, учитываемых на балансовых счетах микрофинансовой организации, которые были определены как реструктурированные на отчетную дату в соответствии с подпунктом 5.9 пункта 5 Указания Банка России от 20 января 2020 года № 5391-У "]
[3,3,"3 – для потребительских займов с лимитом кредитования, учитываемых на балансовых счетах микрофинансовой организации, по которым микрофинансовой организацией принято решение об увеличении лимита кредитования, о продлении срока действия договора потребительского займа с лимитом кредитования, или для иных потребительских займов, учитываемых на балансовых счетах микрофинансовой организации, по которым микрофинансовой организацией принято решение об увеличении размера среднемесячного платежа, за исключением случаев, соответствующих коду «2»"]
[4,4,"4 – для потребительских займов, задолженность заемщика по которым признана безнадежной и списана с баланса микрофинансовой организации"]
[5,5,"5 – для потребительских займов, права требования по которым были уступлены микрофинансовой организацией"]
[6,6,"6 – для потребительских займов и потребительских займов с лимитом кредитования или транша, которые были погашены заемщиком"]

{"sheet":"ИнтервалПСК","index":10,"n_rows":39,"n_cols":3,"rows_kept":39,"cut":false,"hidden":false,"merged":[]}
["Код по справочнику организации","Код для файла отчета","Описание"]
["[0; 10]",1,"[0; 10]"]
["(10; 20]",2,"(10; 20]"]
["(20; 30]",3,"(20; 30]"]
["(30; 40]",4,"(30; 40]"]
["(40; 50]",5,"(40; 50]"]
["(50; 60]",6,"(50; 60]"]
["(60; 70]",7,"(60; 70]"]
["(70; 80]",8,"(70; 80]"]
["(80; 90]",9,"(80; 90]"]
["(90; 100]",10,"(90; 100]"]
["(100; 110]",11,"(100; 110]"]
["(110; 120]",12,"(110; 120]"]
["(120; 130]",13,"(120; 130]"]
["(130; 140]",14,"(130; 140]"]
["(140; 150]",15,"(140; 150]"]
["(150; 160]",16,"(150; 160]"]
["(160; 170]",17,"(160; 170]"]
["(170; 180]",18,"(170; 180]"]
["(180; 190]",19,"(180; 190]"]
["(190; 200]",20,"(190; 200]"]
["(200; 210]",21,"(200; 210]"]
["(210; 220]",22,"(210; 220]"]
["(220; 230]",23,"(220; 230]"]
["(230; 240]",24,"(230; 240]"]
["(240; 250]",25,"(240; 250]"]
["(250; 260]",26,"(250; 260]"]
["(260; 270]",27,"(260; 270]"]
["(270; 280]",28,"(270; 280]"]
["(280; 290]",29,"(280; 290]"]
["(290; 300]",30,"(290; 300]"]
["(300; 310]",31,"(300; 310]"]
["(310; 320]",32,"(310; 320]"]
["(320; 330]",33,"(320; 330]"]
["(330; 340]",34,"(330; 340]"]
["(340; 350]",35,"(340; 350]"]
["(350; 360]",36,"(350; 360]"]
["(360; 370]",37,"(360; 370]"]
["более 370",38,"более 370"]

{"sheet":"ИнтервалПДН","index":11,"n_rows":11,"n_cols":3,"rows_kept":11,"cut":false,"hidden":false,"merged":[]}
["Код по справочнику организации","Код для файла отчета","Описание"]
["[0; 30]",1,"[0; 30]"]
["(30; 40]",2,"(30; 40]"]
["(40; 50]",3,"(40; 50]"]
["(50; 60]",4,"(50; 60]"]
["(60; 70]",5,"(60; 70]"]
["(70; 80]",6,"(70; 80]"]
["(80; 90]",7,"(80; 90]"]
["(90; 100]",8,"(90; 100]"]
["более 100",9,"более 100"]
["не рассчитан",10,"не рассчитан"]

{"sheet":"ИнтервалДохода","index":12,"n_rows":9,"n_cols":3,"rows_kept":9,"cut":false,"hidden":false,"merged":[]}
["Код по справочнику организации","Код для файла отчета","Описание"]
["[0; 12]",1,"[0; 12]"]
["(12; 20]",2,"(12; 20]"]
["(20; 40]",3,"(20; 40]"]
["(40; 75]",4,"(40; 75]"]
["(75; 125]",5,"(75; 125]"]
["более 125",6,"более 125"]
["использовано среднее значение по региону",7,"использовано среднее значение по региону"]
["не применимо",8,"не применимо"]

{"sheet":"ДлительностьПросрочки","index":13,"n_rows":6,"n_cols":3,"rows_kept":6,"cut":false,"hidden":false,"merged":[]}
["Код по справочнику организации","Код для файла отчета","Описание"]
[0,1,"0 – для совокупного объема задолженности по потребительским займам без просроченных платежей на отчетную дату"]
[1,2,"1 – для совокупного объема задолженности по потребительским займам, по которым на отчетную дату имеются просроченные платежи сроком от 1 до 30 дней"]
[2,3,"2 – для совокупного объема задолженности по потребительским займам, по которым на отчетную дату имеются просроченные платежи сроком от 31 до 90 дней"]
[3,4,"3 – для совокупного объема задолженности по потребительским займам, по которым на отчетную дату имеются просроченные платежи сроком от 91 до 360 дней"]
[4,5,"4 – для совокупного объема задолженности по потребительским займам, по которым на отчетную дату имеются просроченные платежи сроком свыше 360 дней"]